Target
Protein kinase C delta type
Ligand
BDBM50055677
Substrate
Meas. Tech.
ChEMBL_160768 (CHEMBL766309)
IC50
6±n/a nM
Citation
 Lai, YSMendoza, JSJagdmann, GEMenaldino, DSBiggers, CKHeerding, JMWilson, JWHall, SEJiang, JBJanzen, WPBallas, LM Synthesis and protein kinase C inhibitory activities of balanol analogs with replacement of the perhydroazepine moiety. J Med Chem 40:226-35 (1997)  
Target
Name:
Protein kinase C delta type
Synonyms:
KPCD_HUMAN PKCD Protein Kinase C- delta nPKC-delta
Type:
Enzyme
Mol. Mass.:
77516.79
Organism:
Homo sapiens (Human)
Description:
The recombinant human PKC enzymes were produced using a baculovirus expression system in SF9 cells
Residue:
676
  
Inhibitor
Name:
BDBM50055677
Synonyms:
4-(2-Carboxy-6-hydroxy-benzoyl)-3,5-dihydroxy-benzoic acid (1R,2R,4S)-4-aminomethyl-2-(4-hydroxy-benzoylamino)-cyclopentyl ester | CHEMBL307708
Type:
Small organic molecule
Emp. Form.:
C28H26N2O10
Mol. Mass.:
550.5134
SMILES:
NC[C@H]1C[C@@H](NC(=O)c2ccc(O)cc2)[C@@H](C1)OC(=O)c1cc(O)c(C(=O)c2c(O)cccc2C(O)=O)c(O)c1
: