Target
Protein kinase C delta type
Ligand
BDBM3152
Substrate
Meas. Tech.
ChEMBL_160768 (CHEMBL766309)
IC50
5±n/a nM
Citation
 Lai, YSMendoza, JSJagdmann, GEMenaldino, DSBiggers, CKHeerding, JMWilson, JWHall, SEJiang, JBJanzen, WPBallas, LM Synthesis and protein kinase C inhibitory activities of balanol analogs with replacement of the perhydroazepine moiety. J Med Chem 40:226-35 (1997)  
Target
Name:
Protein kinase C delta type
Synonyms:
KPCD_HUMAN PKCD Protein Kinase C- delta nPKC-delta
Type:
Enzyme
Mol. Mass.:
77516.79
Organism:
Homo sapiens (Human)
Description:
The recombinant human PKC enzymes were produced using a baculovirus expression system in SF9 cells
Residue:
676
  
Inhibitor
Name:
BDBM3152
Synonyms:
2-{[2,6-dihydroxy-4-({[(3R,4R)-4-[(4-hydroxybenzene)amido]pyrrolidin-3-yl]oxy}carbonyl)phenyl]carbonyl}-3-hydroxybenzoic acid CHEMBL59828
Type:
Small organic molecule
Emp. Form.:
C26H22N2O10
Mol. Mass.:
522.4603
SMILES:
OC(=O)c1cccc(O)c1C(=O)c1c(O)cc(cc1O)C(=O)O[C@@H]1CNC[C@H]1NC(=O)c1ccc(O)cc1
: