Target
5-hydroxytryptamine receptor 1A
Ligand
BDBM50056034
Substrate
Meas. Tech.
ChEMBL_1130 (CHEMBL616075)
Ki
0.8±n/a nM
Citation
 Kuipers, WKruse, CGvan Wijngaarden, IStandaar, PJTulp, MTVeldman, NSpek, ALIJzerman, AP 5-HT1A-versus D2-receptor selectivity of flesinoxan and analogous N4-substituted N1-arylpiperazines. J Med Chem 40:300-12 (1997)  
Target
Name:
5-hydroxytryptamine receptor 1A
Synonyms:
5-HT-1A 5-HT1A 5-hydroxytryptamine receptor 1A (5HT1A) 5ht1a Htr1a Serotonin 1a (5-HT1a) receptor/Adrenergic receptor alpha-1 | Serotonin receptor 1A
Type:
G Protein-Coupled Receptor (GPCR)
Mol. Mass.:
46445.29
Organism:
Rattus norvegicus (rat)
Description:
Binding assays were performed using rat hippocampal membranes.
Residue:
422
  
Inhibitor
Name:
BDBM50056034
Synonyms:
CHEMBL108229 | Cyclohexanecarboxylic acid {2-[4-(2-methoxy-phenyl)-piperazin-1-yl]-ethyl}-amide
Type:
Small organic molecule
Emp. Form.:
C20H31N3O2
Mol. Mass.:
345.479
SMILES:
COc1ccccc1N1CCN(CCNC(=O)C2CCCCC2)CC1
: