Target
Gastrin/cholecystokinin type B receptor
Ligand
BDBM50056090
Substrate
Meas. Tech.
ChEMBL_48592 (CHEMBL662472)
IC50
1.26±n/a nM
Citation
 Semple, GRyder, HRooker, DPBatt, ARKendrick, DASzelke, MOhta, MSatoh, MNishida, AAkuzawa, SMiyata, K (3R)-N-(1-(tert-butylcarbonylmethyl)-2,3-dihydro-2-oxo-5-(2-pyridyl)-1H-1,4-benzodiazepin-3-yl)-N'-(3-(methylamino)phenyl)urea (YF476): a potent and orally active gastrin/CCK-B antagonist. J Med Chem 40:331-41 (1997)  
Target
Name:
Gastrin/cholecystokinin type B receptor
Synonyms:
Cckbr Cholecystokinin B receptor GASR_RAT | Gastrin/cholecystokinin type B receptor
Type:
Enzyme Catalytic Domain
Mol. Mass.:
48980.43
Organism:
RAT
Description:
Cholecystokinin A CCKBR RAT::P30553
Residue:
452
  
Inhibitor
Name:
BDBM50056090
Synonyms:
1-(3-Dimethylamino-phenyl)-3-[(S)-1-(3,3-dimethyl-2-oxo-butyl)-2-oxo-5-pyridin-2-yl-2,3-dihydro-1H-benzo[e][1,4]diazepin-3-yl]-urea | CHEMBL114991
Type:
Small organic molecule
Emp. Form.:
C29H32N6O3
Mol. Mass.:
512.6028
SMILES:
CN(C)c1cccc(NC(=O)N[C@H]2N=C(c3ccccn3)c3ccccc3N(CC(=O)C(C)(C)C)C2=O)c1
: