Target
Cholecystokinin receptor type A
Ligand
BDBM50056098
Substrate
Meas. Tech.
ChEMBL_50192 (CHEMBL663485)
IC50
89±n/a nM
Citation
 Semple, GRyder, HRooker, DPBatt, ARKendrick, DASzelke, MOhta, MSatoh, MNishida, AAkuzawa, SMiyata, K (3R)-N-(1-(tert-butylcarbonylmethyl)-2,3-dihydro-2-oxo-5-(2-pyridyl)-1H-1,4-benzodiazepin-3-yl)-N'-(3-(methylamino)phenyl)urea (YF476): a potent and orally active gastrin/CCK-B antagonist. J Med Chem 40:331-41 (1997)  
Target
Name:
Cholecystokinin receptor type A
Synonyms:
CCKAR_RAT Cholecystokinin peripheral Cholecystokinin receptor type A
Type:
Enzyme Catalytic Domain
Mol. Mass.:
49676.37
Organism:
RAT
Description:
Cholecystokinin central 0 RAT::P30551
Residue:
444
  
Inhibitor
Name:
BDBM50056098
Synonyms:
1-(3-Dimethylamino-phenyl)-3-[(R)-1-(3,3-dimethyl-2-oxo-butyl)-2-oxo-5-phenyl-2,3-dihydro-1H-benzo[e][1,4]diazepin-3-yl]-urea | CHEMBL332931
Type:
Small organic molecule
Emp. Form.:
C30H33N5O3
Mol. Mass.:
511.6147
SMILES:
CN(C)c1cccc(NC(=O)N[C@@H]2N=C(c3ccccc3)c3ccccc3N(CC(=O)C(C)(C)C)C2=O)c1
: