Target
5-hydroxytryptamine receptor 1A
Ligand
BDBM50020680
Substrate
Meas. Tech.
ChEMBL_1548 (CHEMBL616370)
Ki
1706±n/a nM
Citation
 Heier, RFDolak, LADuncan, JNHyslop, DKLipton, MFMartin, IJMauragis, MAPiercey, MFNichols, NFSchreur, PJSmith, MWMoon, MW Synthesis and biological activities of (R)-5,6-dihydro-N,N-dimethyl-4H-imidazo[4,5,1-ij]quinolin-5-amine and its metabolites. J Med Chem 40:639-46 (1997)  
Target
Name:
5-hydroxytryptamine receptor 1A
Synonyms:
5-HT-1A 5-hydroxytryptamine receptor 1A (5-HT-1A) ADRB2RL1 Dopamine D2 receptor and serotonin 1a receptor HTR1A | Serotonin receptor 1A
Type:
Mol. Mass.:
46122.49
Organism:
Homo sapiens (Human)
Description:
Residue:
422
  
Inhibitor
Name:
BDBM50020680
Synonyms:
4-[2-(dipropylamino)ethyl]-1,3-dihydro-2H-indol-2-one ROPINIROLE
Type:
Small organic molecule
Emp. Form.:
C16H24N2O
Mol. Mass.:
260.3746
SMILES:
CCCN(CCC)CCc1cccc2NC(=O)Cc12
: