Target
D(2) dopamine receptor
Ligand
BDBM50020680
Substrate
Meas. Tech.
ChEMBL_61124 (CHEMBL672313)
Ki
7.2±n/a nM
Citation
 Heier, RFDolak, LADuncan, JNHyslop, DKLipton, MFMartin, IJMauragis, MAPiercey, MFNichols, NFSchreur, PJSmith, MWMoon, MW Synthesis and biological activities of (R)-5,6-dihydro-N,N-dimethyl-4H-imidazo[4,5,1-ij]quinolin-5-amine and its metabolites. J Med Chem 40:639-46 (1997)  
Target
Name:
D(2) dopamine receptor
Synonyms:
D(2) dopamine receptor DOPAMINE D2 Long DRD2 Dopamine D2 receptor Dopamine D2 receptor (D2R) Dopamine2-like | d2
Type:
Cell-surface receptors
Mol. Mass.:
50647.10
Organism:
Homo sapiens (Human)
Description:
P14416
Residue:
443
  
Inhibitor
Name:
BDBM50020680
Synonyms:
4-[2-(dipropylamino)ethyl]-1,3-dihydro-2H-indol-2-one ROPINIROLE
Type:
Small organic molecule
Emp. Form.:
C16H24N2O
Mol. Mass.:
260.3746
SMILES:
CCCN(CCC)CCc1cccc2NC(=O)Cc12
: