Target
D(2) dopamine receptor
Ligand
BDBM50056444
Substrate
Meas. Tech.
ChEMBL_61124 (CHEMBL672313)
Ki
12±n/a nM
Citation
 Heier, RFDolak, LADuncan, JNHyslop, DKLipton, MFMartin, IJMauragis, MAPiercey, MFNichols, NFSchreur, PJSmith, MWMoon, MW Synthesis and biological activities of (R)-5,6-dihydro-N,N-dimethyl-4H-imidazo[4,5,1-ij]quinolin-5-amine and its metabolites. J Med Chem 40:639-46 (1997)  
Target
Name:
D(2) dopamine receptor
Synonyms:
D(2) dopamine receptor DOPAMINE D2 Long DRD2 Dopamine D2 receptor Dopamine D2 receptor (D2R) Dopamine2-like | d2
Type:
Cell-surface receptors
Mol. Mass.:
50647.10
Organism:
Homo sapiens (Human)
Description:
P14416
Residue:
443
  
Inhibitor
Name:
BDBM50056444
Synonyms:
(R)-5-Dimethylamino-5,6-dihydro-1H,4H-imidazo[4,5,1-ij]quinolin-2-one | CHEMBL422344
Type:
Small organic molecule
Emp. Form.:
C12H15N3O
Mol. Mass.:
217.267
SMILES:
CN(C)[C@@H]1Cc2cccc3[nH]c(=O)n(C1)c23
: