Target
Stromelysin-1
Ligand
BDBM50057074
Substrate
Meas. Tech.
ChEMBL_104738 (CHEMBL710738)
Ki
10±n/a nM
Citation
 Esser, CKBugianesi, RLCaldwell, CGChapman, KTDurette, PLGirotra, NNKopka, IELanza, TJLevorse, DAMacCoss, MOwens, KAPonpipom, MMSimeone, JPHarrison, RKNiedzwiecki, LBecker, JWMarcy, AIAxel, MGChristen, AJMcDonnell, JMoore, VLOlszewski, JMSaphos, CVisco, DMHagmann, WK Inhibition of stromelysin-1 (MMP-3) by P1'-biphenylylethyl carboxyalkyl dipeptides. J Med Chem 40:1026-40 (1997)  
Target
Name:
Stromelysin-1
Synonyms:
MMP-3 MMP3_HUMAN Matrix metalloproteinase 3 Matrix metalloproteinase-3 (MMP-3) SL-1 Stromelysin 1 | Transin-1
Type:
Enzyme
Mol. Mass.:
53973.13
Organism:
Homo sapiens (Human)
Description:
P08254
Residue:
477
  
Inhibitor
Name:
BDBM50057074
Synonyms:
(2S,4R)-2-Butyl-4-((S)-2,2-dimethyl-1-methylcarbamoyl-propylcarbamoyl)-6-(4'-fluoro-biphenyl-4-yl)-hexanoic acid | CHEMBL8828
Type:
Small organic molecule
Emp. Form.:
C30H41FN2O4
Mol. Mass.:
512.6559
SMILES:
CCCC[C@@H](C[C@@H](CCc1ccc(cc1)-c1ccc(F)cc1)C(=O)N[C@H](C(=O)NC)C(C)(C)C)C(O)=O
: