Target
Fucose-binding lectin PA-IIL
Ligand
BDBM50505589
Substrate
Meas. Tech.
ChEMBL_1823413 (CHEMBL4323177)
IC50
1040±n/a nM
Citation
 Sommer, RRox, KWagner, SHauck, DHenrikus, SSNewsad, SArnold, TRyckmans, TBrönstrup, MImberty, AVarrot, AHartmann, RWTitz, A Anti-biofilm Agents against  J Med Chem 62:9201-9216 (2019)  
Target
Name:
Fucose-binding lectin PA-IIL
Synonyms:
LecB | PA-IIL
Type:
Protein
Mol. Mass.:
11857.84
Organism:
Pseudomonas aeruginosa
Description:
Q9HYN5
Residue:
115
  
Inhibitor
Name:
BDBM50505589
Synonyms:
CHEMBL4514935
Type:
Small organic molecule
Emp. Form.:
C11H15Cl2NO6S2
Mol. Mass.:
392.276
SMILES:
C[C@@H]1O[C@H](CNS(=O)(=O)c2cc(Cl)c(Cl)s2)[C@@H](O)[C@H](O)[C@@H]1O
: