Target
Fucose-binding lectin PA-IIL
Ligand
BDBM50505616
Substrate
Meas. Tech.
ChEMBL_1823425 (CHEMBL4323189)
IC50
1860±n/a nM
Citation
 Sommer, RRox, KWagner, SHauck, DHenrikus, SSNewsad, SArnold, TRyckmans, TBrönstrup, MImberty, AVarrot, AHartmann, RWTitz, A Anti-biofilm Agents against  J Med Chem 62:9201-9216 (2019)  
Target
Name:
Fucose-binding lectin PA-IIL
Synonyms:
LecB | PA-IIL
Type:
Protein
Mol. Mass.:
11857.84
Organism:
Pseudomonas aeruginosa
Description:
Q9HYN5
Residue:
115
  
Inhibitor
Name:
BDBM50505616
Synonyms:
CHEMBL3590172
Type:
Small organic molecule
Emp. Form.:
C16H25NO7S
Mol. Mass.:
375.437
SMILES:
CO[C@H]1O[C@H](CNS(=O)(=O)c2c(C)cc(C)cc2C)[C@@H](O)[C@H](O)[C@@H]1O
: