Target
Fucose-binding lectin PA-IIL
Ligand
BDBM50505617
Substrate
Meas. Tech.
ChEMBL_1823424 (CHEMBL4323188)
IC50
840±n/a nM
Citation
 Sommer, RRox, KWagner, SHauck, DHenrikus, SSNewsad, SArnold, TRyckmans, TBrönstrup, MImberty, AVarrot, AHartmann, RWTitz, A Anti-biofilm Agents against  J Med Chem 62:9201-9216 (2019)  
Target
Name:
Fucose-binding lectin PA-IIL
Synonyms:
LecB | PA-IIL
Type:
Protein
Mol. Mass.:
11857.84
Organism:
Pseudomonas aeruginosa
Description:
Q9HYN5
Residue:
115
  
Inhibitor
Name:
BDBM50505617
Synonyms:
CHEMBL1234282
Type:
Small organic molecule
Emp. Form.:
C7H14O5
Mol. Mass.:
178.1831
SMILES:
CO[C@@H]1O[C@@H](C)[C@@H](O)[C@@H](O)[C@@H]1O
: