Target
Aryl hydrocarbon receptor
Ligand
BDBM50506041
Substrate
Meas. Tech.
ChEMBL_1824674 (CHEMBL4324438)
Ki
21600±n/a nM
Citation
 Dolciami, DBallarotto, MGargaro, MLópez-Cara, LCFallarino, FMacchiarulo, A Targeting Aryl hydrocarbon receptor for next-generation immunotherapies: Selective modulators (SAhRMs) versus rapidly metabolized ligands (RMAhRLs). Eur J Med Chem 185:0 (2020)  
Target
Name:
Aryl hydrocarbon receptor
Synonyms:
AHR BHLHE76 aryl hydrocarbon receptor precursor
Type:
PROTEIN
Mol. Mass.:
96143.77
Organism:
Homo sapiens (Human)
Description:
ChEMBL_1503828
Residue:
848
  
Inhibitor
Name:
BDBM50506041
Synonyms:
CHEBI:16946 | L-kynurenine
Type:
Small organic molecule
Emp. Form.:
C10H12N2O3
Mol. Mass.:
208.2139
SMILES:
N[C@@H](CC(=O)c1ccccc1N)C(O)=O
: