Target
Prothrombin
Ligand
BDBM50057826
Substrate
Meas. Tech.
ChEMBL_208501 (CHEMBL811976)
Ki
0.056±n/a nM
Citation
 Tucker, TJLumma, WCLewis, SDGardell, SJLucas, BJBaskin, EPWoltmann, RLynch, JJLyle, EAAppleby, SDChen, IWDancheck, KBVacca, JP Potent noncovalent thrombin inhibitors that utilize the unique amino acid D-dicyclohexylalanine in the P3 position. Implications on oral bioavailability and antithrombotic efficacy. J Med Chem 40:1565-9 (1997)  
Target
Name:
Prothrombin
Synonyms:
Activation peptide fragment 1 Coagulation factor II Prothrombin precursor Thrombin heavy chain | Thrombin light chain
Type:
Protein
Mol. Mass.:
70029.57
Organism:
Homo sapiens (Human)
Description:
P00734
Residue:
622
  
Inhibitor
Name:
BDBM50057826
Synonyms:
(S)-1-((R)-2-Amino-3,3-dicyclohexyl-propionyl)-pyrrolidine-2-carboxylic acid (4-amino-cyclohexylmethyl)-amide CHEMBL289395
Type:
Small organic molecule
Emp. Form.:
C27H48N4O2
Mol. Mass.:
460.6956
SMILES:
N[C@H](C(C1CCCCC1)C1CCCCC1)C(=O)N1CCC[C@H]1C(=O)NCC1CCC(N)CC1
: