Target
Dual specificity mitogen-activated protein kinase kinase 2
Ligand
BDBM50506079
Substrate
Meas. Tech.
ChEMBL_1824783 (CHEMBL4324547)
IC50
1500±n/a nM
Citation
 Wei, JHu, JWang, LXie, LJin, MSChen, XLiu, JJin, J Discovery of a First-in-Class Mitogen-Activated Protein Kinase Kinase 1/2 Degrader. J Med Chem 62:10897-10911 (2019)  
Target
Name:
Dual specificity mitogen-activated protein kinase kinase 2
Synonyms:
Dual specificity mitogen-activated protein kinase kinase 2 (MEK2) ERK activator kinase 2 MAP2K2 MAPKK 2 MKK2 PRKMK2 | VHL-MAP2K1/MAP2K2
Type:
Enzyme Catalytic Domain
Mol. Mass.:
44423.61
Organism:
Homo sapiens (Human)
Description:
gi_13489054
Residue:
400
  
Inhibitor
Name:
BDBM50506079
Synonyms:
CHEMBL4446127
Type:
Small organic molecule
Emp. Form.:
C50H65F3IN7O6S
Mol. Mass.:
1076.059
SMILES:
C[C@H](NC(=O)[C@H]1C[C@H](O)CN1C(=O)[C@@H](NC(=O)CCCCCCCCCCNCCCONC(=O)c1ccc(F)c(F)c1Nc1ccc(I)cc1F)C(C)(C)C)c1ccc(cc1)-c1scnc1C
: