Target
Prostaglandin G/H synthase 2
Ligand
BDBM50057944
Substrate
Meas. Tech.
ChEMBL_159742 (CHEMBL762906)
IC50
1540±n/a nM
Citation
 Khanna, IKWeier, RMYu, YXu, XDKoszyk, FJCollins, PWKoboldt, CMVeenhuizen, AWPerkins, WECasler, JJMasferrer, JLZhang, YYGregory, SASeibert, KIsakson, PC 1,2-Diarylimidazoles as potent, cyclooxygenase-2 selective, and orally active antiinflammatory agents. J Med Chem 40:1634-47 (1997)  
Target
Name:
Prostaglandin G/H synthase 2
Synonyms:
COX2 Cyclooxygenase 2 (COX-2) Cyclooxygenase-2 (COX-2 AA) Cyclooxygenase-2 (COX-2) PGH2_HUMAN PHS II Prostaglandin E synthase/G/H synthase 2 Prostaglandin-endoperoxide synthase 2
Type:
Enzyme
Mol. Mass.:
69003.89
Organism:
Homo sapiens (Human)
Description:
Recombinant Cox-2 provided by Cayman (Cayman Chemical Co.,Ann Arbor, MI).
Residue:
604
  
Inhibitor
Name:
BDBM50057944
Synonyms:
CHEMBL43090 | [2-(4-Chloro-phenyl)-1-(4-methanesulfonyl-phenyl)-1H-imidazol-4-yl]-acetonitrile
Type:
Small organic molecule
Emp. Form.:
C18H14ClN3O2S
Mol. Mass.:
371.841
SMILES:
CS(=O)(=O)c1ccc(cc1)-n1cc(CC#N)nc1-c1ccc(Cl)cc1
: