Target
Caspase-1
Ligand
BDBM50058528
Substrate
Meas. Tech.
ChEMBL_90980 (CHEMBL696527)
Ki
5±n/a nM
Citation
 Dolle, REPrasad, CVProuty, CPSalvino, JMAwad, MMSchmidt, SJHoyer, DRoss, TMGraybill, TLSpeier, GJUhl, JMiller, BEHelaszek, CTAtor, MA Pyridazinodiazepines as a high-affinity, P2-P3 peptidomimetic class of interleukin-1 beta-converting enzyme inhibitor. J Med Chem 40:1941-6 (1997)  
Target
Name:
Caspase-1
Synonyms:
CASP1 Caspase ICE IL1BCE Interleukin-1 beta-converting enzyme
Type:
Enzyme
Mol. Mass.:
45154.13
Organism:
Homo sapiens (Human)
Description:
P29466
Residue:
404
  
Inhibitor
Name:
BDBM50058528
Synonyms:
(S)-3-[((1S,9S)-9-Benzoylamino-6,10-dioxo-octahydro-pyridazino[1,2-a][1,2]diazepine-1-carbonyl)-amino]-4-oxo-butyric acid PD-194035
Type:
Small organic molecule
Emp. Form.:
C21H24N4O7
Mol. Mass.:
444.4379
SMILES:
OC(=O)C[C@H](NC(=O)[C@@H]1CCCN2N1C(=O)[C@H](CCC2=O)NC(=O)c1ccccc1)C=O
: