Target
Fucose-binding lectin PA-IIL
Ligand
BDBM50505593
Substrate
Meas. Tech.
ChEMBL_1827064 (CHEMBL4326938)
IC50
970±n/a nM
Citation
 Parrino, BSchillaci, DCarnevale, IGiovannetti, EDiana, PCirrincione, GCascioferro, S Synthetic small molecules as anti-biofilm agents in the struggle against antibiotic resistance. Eur J Med Chem 161:154-178 (2019)  
Target
Name:
Fucose-binding lectin PA-IIL
Synonyms:
LecB | PA-IIL
Type:
Protein
Mol. Mass.:
11857.84
Organism:
Pseudomonas aeruginosa
Description:
Q9HYN5
Residue:
115
  
Inhibitor
Name:
BDBM50505593
Synonyms:
CHEMBL4453855
Type:
Small organic molecule
Emp. Form.:
C16H25NO6S
Mol. Mass.:
359.438
SMILES:
C[C@@H]1O[C@H](CNS(=O)(=O)c2c(C)cc(C)cc2C)[C@@H](O)[C@H](O)[C@@H]1O
: