Target
D(4) dopamine receptor
Ligand
BDBM50050472
Substrate
Meas. Tech.
ChEMBL_60829 (CHEMBL675818)
Ki
5.5±n/a nM
Citation
 Rowley, MCollins, IBroughton, HBDavey, WBBaker, REmms, FMarwood, RPatel, SPatel, SRagan, CIFreedman, SBBall, RLeeson, PD 4-Heterocyclylpiperidines as selective high-affinity ligands at the human dopamine D4 receptor. J Med Chem 40:2374-85 (1997)  
Target
Name:
D(4) dopamine receptor
Synonyms:
D(2C) dopamine receptor DOPAMINE D4.2 DRD4 Dopamine D4 receptor
Type:
Enzyme
Mol. Mass.:
48373.19
Organism:
Homo sapiens (Human)
Description:
P21917
Residue:
419
  
Inhibitor
Name:
BDBM50050472
Synonyms:
4-[5-(4-Chloro-phenyl)-1H-pyrazol-3-yl]-1-phenethyl-piperidine CHEMBL6416
Type:
Small organic molecule
Emp. Form.:
C22H24ClN3
Mol. Mass.:
365.899
SMILES:
Clc1ccc(cc1)-c1cc([nH]n1)C1CCN(CCc2ccccc2)CC1
: