Target
Gastrin/cholecystokinin type B receptor
Ligand
BDBM50043493
Substrate
Meas. Tech.
ChEMBL_47982 (CHEMBL657484)
IC50
0.56±n/a nM
Citation
 Castro, JLBroughton, HBRussell, MGRathbone, DWatt, APBall, RGChapman, KLPatel, SSmith, AJMarshall, GRMatassa, VG 5-(Piperidin-2-yl)- and 5-(homopiperidin-2-yl)-1,4-benzodiazepines: high-affinity, basic ligands for the cholecystokinin-B receptor. J Med Chem 40:2491-501 (1997)  
Target
Name:
Gastrin/cholecystokinin type B receptor
Synonyms:
CCK-2 receptor CCK-BR CCKRB Cholecystokinin receptor GASR_HUMAN | Gastrin/cholecystokinin type B receptor
Type:
G Protein-Coupled Receptor (GPCR)
Mol. Mass.:
48445.79
Organism:
Homo sapiens (Human)
Description:
Stable expression of human CCK-2 receptors in HEK 293 cells.
Residue:
447
  
Inhibitor
Name:
BDBM50043493
Synonyms:
CHEMBL313813 | N,N-Diethyl-2-[2-oxo-5-pyridin-2-yl-3-(3-m-tolyl-ureido)-2,3-dihydro-benzo[e][1,4]diazepin-1-yl]-acetamide
Type:
Small organic molecule
Emp. Form.:
C28H30N6O3
Mol. Mass.:
498.5762
SMILES:
CCN(CC)C(=O)CN1c2ccccc2C(=NC(NC(=O)Nc2cccc(C)c2)C1=O)c1ccccn1
: