Target
Delta-type opioid receptor
Ligand
BDBM50002346
Substrate
Meas. Tech.
ChEMBL_146895 (CHEMBL751669)
Ki
2.1±n/a nM
Citation
 Choi, HMurray, TFDeLander, GESchmidt, WKAldrich, JV Synthesis and opioid activity of [D-Pro10]dynorphin A-(1-11) analogues with N-terminal alkyl substitution. J Med Chem 40:2733-9 (1997)  
Target
Name:
Delta-type opioid receptor
Synonyms:
Cytochrome P450 3A4 Delta opioid receptor Delta-type opioid receptor (DOR) OPRD_RAT Opioid receptor Opioid receptors; mu & delta Ror-a | Voltage-gated potassium channel
Type:
G Protein-Coupled Receptor (GPCR)
Mol. Mass.:
40465.04
Organism:
Rattus norvegicus (rat)
Description:
Competition binding assays were using CHO-K1 cell membranes expressing the opioid receptor.
Residue:
372
  
Inhibitor
Name:
BDBM50002346
Synonyms:
CHEMBL384584 | [D-pro10]Dynorphin A(1-11)
Type:
Small organic molecule
Emp. Form.:
C63H103N21O13
Mol. Mass.:
1362.6248
SMILES:
CC[C@H](C)[C@H](NC(=O)[C@H](CCCNC(N)=N)NC(=O)[C@H](CCCNC(N)=N)NC(=O)[C@H](CC(C)C)NC(=O)[C@H](Cc1ccccc1)NC(=O)CNC(=O)CNC(=O)[C@@H](N)Cc1ccc(O)cc1)C(=O)N[C@@H](CCCNC(N)=N)C(=O)N1CCC[C@@H]1C(=O)N[C@@H](CCCCN)C(O)=O
: