Target
Cholinesterase
Ligand
BDBM10609
Substrate
Meas. Tech.
ChEMBL_41428 (CHEMBL876073)
IC50
2489±n/a nM
Citation
 Yu, QSPei, XFHolloway, HWGreig, NHBrossi, A Total syntheses and anticholinesterase activities of (3aS)-N(8)-norphysostigmine, (3aS)-N(8)-norphenserine, their antipodal isomers, and other N(8)-substituted analogues. J Med Chem 40:2895-901 (1997)  
Target
Name:
Cholinesterase
Synonyms:
Acylcholine acylhydrolase Butyrylcholine esterase (BChE) Butyrylcholinesterase (BuChE) CHLE_HUMAN Cholinesterases Pseudocholinesterase
Type:
Homotetramer
Mol. Mass.:
68422.27
Organism:
Homo sapiens (Human)
Description:
P06276
Residue:
602
  
Inhibitor
Name:
BDBM10609
Synonyms:
(+)-Physostigmine CHEMBL76640 | Physostigmine Carbamate 15b
Type:
Small organic molecule
Emp. Form.:
C15H21N3O2
Mol. Mass.:
275.3461
SMILES:
CNC(=O)Oc1ccc2N(C)C3N(C)CC[C@]3(C)c2c1
: