Target
Dihydrofolate reductase
Ligand
BDBM18050
Substrate
Meas. Tech.
ChEMBL_52977 (CHEMBL664185)
IC50
1.3±n/a nM
Citation
 Robson, CMeek, MAGrunwaldt, JDLambert, PAQueener, SFSchmidt, DGriffin, RJ Nonclassical 2,4-diamino-5-aryl-6-ethylpyrimidine antifolates: activity as inhibitors of dihydrofolate reductase from Pneumocystis carinii and Toxoplasma gondii and as antitumor agents. J Med Chem 40:3040-8 (1997)  
Target
Name:
Dihydrofolate reductase
Synonyms:
DYR_PNECA Dihydrofolate reductase Tetrahydrofolate dehydrogenase
Type:
Enzyme
Mol. Mass.:
23891.29
Organism:
Pneumocystis carinii
Description:
Residue:
206
  
Inhibitor
Name:
BDBM18050
Synonyms:
2-[(4-{[(2,4-diaminopteridin-6-yl)methyl](methyl)amino}phenyl)formamido]pentanedioic acid MTX cid_126941
Type:
Small organic molecule
Emp. Form.:
C20H22N8O5
Mol. Mass.:
454.4393
SMILES:
CN(Cc1cnc2nc(N)nc(N)c2n1)c1ccc(cc1)C(=O)N[C@@H](CCC(O)=O)C(O)=O
: