Target
Mu-type opioid receptor
Ligand
BDBM50059994
Substrate
Meas. Tech.
ChEMBL_148517 (CHEMBL758127)
Ki
0.72±n/a nM
Citation
 Fang, XLarson, DLPortoghese, PS 7-spirobenzocyclohexyl derivatives of naltrexone, oxymorphone, and hydromorphone as selective opioid receptor ligands. J Med Chem 40:3064-70 (1997)  
Target
Name:
Mu-type opioid receptor
Synonyms:
M-OR-1 Mor OPRM_MOUSE Oprm | Oprm1
Type:
Enzyme Catalytic Domain
Mol. Mass.:
44431.62
Organism:
MOUSE
Description:
OPIATE Mu OPRM1 MOUSE::P42866
Residue:
398
  
Inhibitor
Name:
BDBM50059994
Synonyms:
7 alpha-Spirobenzocyclohexylnaltrexone | CHEMBL105081
Type:
Small organic molecule
Emp. Form.:
C29H31NO4
Mol. Mass.:
457.5607
SMILES:
Oc1ccc2CC3N(CC4CC4)CCC45[C@@H](Oc1c24)C(=O)[C@]1(CCc2ccccc2C1)C[C@@]35O
: