Target
Cathepsin G
Ligand
BDBM50279765
Substrate
Meas. Tech.
ChEMBL_45530 (CHEMBL660233)
pH
7.5±n/a
Ki
>15000±n/a nM
Comments
extracted
Citation
 Regan, JMcGarry, DBruno, JGreen, DNewman, JHsu, CYKline, JBarton, JTravis, JChoi, YMVolz, FPauls, HHarrison, RZilberstein, ABen-Sasson, SAChang, M Anionic- and lipophilic-mediated surface binding inhibitors of human leukocyte elastase. J Med Chem 40:3408-22 (1997)  
Target
Name:
Cathepsin G
Synonyms:
CATG_HUMAN CTSG
Type:
PROTEIN
Mol. Mass.:
28860.08
Organism:
Homo sapiens (Human)
Description:
ChEMBL_1469016
Residue:
255
  
Inhibitor
Name:
BDBM50279765
Synonyms:
CHEMBL215405 | {2-{4-[5-Carboxymethoxy-4-(5-cyclohexylmethoxy-2-methoxy-4-methyl-benzyl)-2-methoxy-benzyl]-5-cyclohexylmethoxy-2-methoxy-benzyl}-5-[4-(2-carboxymethoxy-5-methoxy-benzyl)-2-cyclohexylmethoxy-5-methoxy-benzyl]-4-methoxy-phenoxy}-acetic acid
Type:
Small organic molecule
Emp. Form.:
C75H92O18
Mol. Mass.:
1281.5222
SMILES:
COc1ccc(OCC(O)=O)c(Cc2cc(OCC3CCCCC3)c(Cc3cc(OCC(O)=O)c(Cc4cc(OCC5CCCCC5)c(Cc5cc(OCC(O)=O)c(Cc6cc(OCC7CCCCC7)c(C)cc6OC)cc5OC)cc4OC)cc3OC)cc2OC)c1
: