Target
Cathepsin G
Ligand
BDBM50279766
Substrate
Meas. Tech.
ChEMBL_45530 (CHEMBL660233)
pH
7.5±n/a
Ki
1500±n/a nM
Comments
extracted
Citation
 Regan, JMcGarry, DBruno, JGreen, DNewman, JHsu, CYKline, JBarton, JTravis, JChoi, YMVolz, FPauls, HHarrison, RZilberstein, ABen-Sasson, SAChang, M Anionic- and lipophilic-mediated surface binding inhibitors of human leukocyte elastase. J Med Chem 40:3408-22 (1997)  
Target
Name:
Cathepsin G
Synonyms:
CATG_HUMAN CTSG
Type:
PROTEIN
Mol. Mass.:
28860.08
Organism:
Homo sapiens (Human)
Description:
ChEMBL_1469016
Residue:
255
  
Inhibitor
Name:
BDBM50279766
Synonyms:
CHEMBL213783 | {2-{5-Benzyloxy-4-[4-(5-benzyloxy-4-hydroxymethyl-2-methoxy-benzyl)-5-carboxymethoxy-2-methoxy-benzyl]-2-methoxy-benzyl}-5-[2-benzyloxy-4-(2-carboxymethoxy-5-hydroxy-benzyl)-5-methoxy-benzyl]-4-methoxy-phenoxy}-acetic acid
Type:
Small organic molecule
Emp. Form.:
C74H72O19
Mol. Mass.:
1265.3521
SMILES:
COc1cc(CO)c(OCc2ccccc2)cc1Cc1cc(OC)c(Cc2cc(OC)c(Cc3cc(OC)c(Cc4cc(OC)c(Cc5cc(O)ccc5OCC(O)=O)cc4OCc4ccccc4)cc3OCC(O)=O)cc2OCc2ccccc2)cc1OCC(O)=O
: