Target
Cholinesterase
Ligand
BDBM50060477
Substrate
Meas. Tech.
ChEMBL_41408 (CHEMBL653528)
IC50
52.0±n/a nM
Citation
 McKenna, MTProctor, GRYoung, LCHarvey, AL Novel tacrine analogues for potential use against Alzheimer's disease: potent and selective acetylcholinesterase inhibitors and 5-HT uptake inhibitors. J Med Chem 40:3516-23 (1997)  
Target
Name:
Cholinesterase
Synonyms:
Acylcholine acylhydrolase Butyrylcholine esterase (BChE) Butyrylcholinesterase (BuChE) CHLE_HUMAN Cholinesterases Pseudocholinesterase
Type:
Homotetramer
Mol. Mass.:
68422.27
Organism:
Homo sapiens (Human)
Description:
P06276
Residue:
602
  
Inhibitor
Name:
BDBM50060477
Synonyms:
2,3-Dihydro-1H-cyclopenta[b]quinolin-9-ylamine CHEMBL118752
Type:
Small organic molecule
Emp. Form.:
C12H12N2
Mol. Mass.:
184.2371
SMILES:
Nc1c2CCCc2nc2ccccc12
: