Target
Non-receptor tyrosine-protein kinase TYK2
Ligand
BDBM50507816
Substrate
Meas. Tech.
ChEMBL_1831743 (CHEMBL4331751)
Ki
0.020000±n/a nM
Citation
 Yuan, XWu, HBu, HZhou, JZhang, H Targeting the immunity protein kinases for immuno-oncology. Eur J Med Chem 163:413-427 (2019)  
Target
Name:
Non-receptor tyrosine-protein kinase TYK2
Synonyms:
Non-receptor tyrosine-protein kinase TYK2 (TYK2) TYK2_HUMAN | Tyrosine-protein kinase TYK2
Type:
Protein
Mol. Mass.:
133666.03
Organism:
Homo sapiens (Human)
Description:
P29597
Residue:
1187
  
Inhibitor
Name:
BDBM50507816
Synonyms:
Bms-986165 | Deucravacitinib
Type:
Small organic molecule
Emp. Form.:
C20H22N8O3
Mol. Mass.:
425.459
SMILES:
[2H]C([2H])([2H])NC(=O)c1nnc(NC(=O)C2CC2)cc1Nc1cccc(-c2ncn(C)n2)c1OC
: