Target
Type 1 fimbrin D-mannose specific adhesin
Ligand
BDBM50507930
Substrate
Meas. Tech.
ChEMBL_1831845 (CHEMBL4331853)
IC50
310±n/a nM
Citation
 Maddirala, ARKlein, RPinkner, JSKalas, VHultgren, SJJanetka, JW Biphenyl Gal and GalNAc FmlH Lectin Antagonists of Uropathogenic E. coli (UPEC): Optimization through Iterative Rational Drug Design. J Med Chem 62:467-479 (2019)  
Target
Name:
Type 1 fimbrin D-mannose specific adhesin
Synonyms:
Adhesin protein fimH fimH
Type:
PROTEIN
Mol. Mass.:
31474.61
Organism:
Escherichia coli (strain K12)
Description:
ChEMBL_1298296
Residue:
300
  
Inhibitor
Name:
BDBM50507930
Synonyms:
CHEMBL4439694
Type:
Small organic molecule
Emp. Form.:
C22H26N2O7
Mol. Mass.:
430.451
SMILES:
CC(=O)N[C@@H]1[C@@H](O)[C@@H](O)[C@@H](CO)O[C@H]1Oc1ccccc1-c1cccc(NC(C)=O)c1
: