Target
Neutrophil elastase
Ligand
BDBM50061054
Substrate
Meas. Tech.
ChEMBL_63839 (CHEMBL674889)
Ki
0.81±n/a nM
Citation
 Veale, CABernstein, PRBohnert, CMBrown, FJBryant, CDamewood, JREarley, RFeeney, SWEdwards, PDGomes, BHulsizer, JMKosmider, BJKrell, RDMoore, GSalcedo, TWShaw, ASilberstein, DSSteelman, GBStein, MStrimpler, AThomas, RMVacek, EPWilliams, JCWolanin, DJWoolson, S Orally active trifluoromethyl ketone inhibitors of human leukocyte elastase. J Med Chem 40:3173-81 (1997)  
Target
Name:
Neutrophil elastase
Synonyms:
Bone marrow serine protease Coagulation factor X ELANE Elastase HLE Leukocyte elastase Medullasin Neutrophil elastase (HNE) PMN elastase Trypsin
Type:
Enzyme
Mol. Mass.:
28532.38
Organism:
Homo sapiens (Human)
Description:
P08246
Residue:
267
  
Inhibitor
Name:
BDBM50061054
Synonyms:
CHEMBL110125 {(S)-1-[(S)-2-((S)-4-Amino-3,3-difluoro-1-isopropyl-2-oxo-butylcarbamoyl)-pyrrolidine-1-carbonyl]-2-methyl-propyl}-carbamic acid phenyl ester
Type:
Small organic molecule
Emp. Form.:
C24H34F2N4O5
Mol. Mass.:
496.5474
SMILES:
CC(C)[C@H](NC(=O)Oc1ccccc1)C(=O)N1CCC[C@H]1C(=O)N[C@@H](C(C)C)C(=O)C(F)(F)CN
: