Target
Mu-type opioid receptor
Ligand
BDBM50508338
Substrate
Meas. Tech.
ChEMBL_1832902 (CHEMBL4332910)
EC50
2.3±n/a nM
Citation
 Zheng, YObeng, SWang, HJali, AMPeddibhotla, BWilliams, DAZou, CStevens, DLDewey, WLAkbarali, HISelley, DEZhang, Y Design, Synthesis, and Biological Evaluation of the Third Generation 17-Cyclopropylmethyl-3,14?-dihydroxy-4,5?-epoxy-6?-[(4'-pyridyl)carboxamido]morphinan (NAP) Derivatives as ?/? Opioid Receptor Dual Selective Ligands. J Med Chem 62:561-574 (2019)  
Target
Name:
Mu-type opioid receptor
Synonyms:
M-OR-1 Mor OPRM_MOUSE Oprm | Oprm1
Type:
Enzyme Catalytic Domain
Mol. Mass.:
44431.62
Organism:
MOUSE
Description:
OPIATE Mu OPRM1 MOUSE::P42866
Residue:
398
  
Inhibitor
Name:
BDBM50508338
Synonyms:
CHEMBL4569785
Type:
Small organic molecule
Emp. Form.:
C28H33N3O4
Mol. Mass.:
475.5793
SMILES:
[H][C@@]12Oc3c4c(C[C@@]5([H])N(CC6CC6)CC[C@@]14[C@@]5(O)CC[C@H]2NC(=O)c1ccncc1CC)ccc3O
: