Target
Steroid 17-alpha-hydroxylase/17,20 lyase
Ligand
BDBM50061188
Substrate
Meas. Tech.
ChEMBL_50382 (CHEMBL661724)
IC50
1113±n/a nM
Citation
 Ling, YZLi, JSLiu, YKato, KKlus, GTBrodie, A 17-Imidazolyl, pyrazolyl, and isoxazolyl androstene derivatives. Novel steroidal inhibitors of human cytochrome C17,20-lyase (P450(17 alpha). J Med Chem 40:3297-304 (1997)  
Target
Name:
Steroid 17-alpha-hydroxylase/17,20 lyase
Synonyms:
CP17A_HUMAN CYP17A1 Cytochrome P450 17A1 Cytochrome P450 C17 (CYP17) Cytochrome P450-C17 P450-C17 Steroid 17-alpha-Monooxygenase (CYP17) Steroid 17-alpha-monooxygenase | cytochrome P450 monooxygenase 17 alpha hydroxylase/17,20-lyase (CYP17)
Type:
Enzyme
Mol. Mass.:
57382.42
Organism:
Homo sapiens (Human)
Description:
E.coli expressing human CYP17
Residue:
508
  
Inhibitor
Name:
BDBM50061188
Synonyms:
(10R,13S)-17-Isoxazol-3-yl-10,13-dimethyl-2,3,4,7,8,9,10,11,12,13,14,15,16,17-tetradecahydro-1H-cyclopenta[a]phenanthren-3-ol | CHEMBL113205
Type:
Small organic molecule
Emp. Form.:
C22H31NO2
Mol. Mass.:
341.487
SMILES:
C[C@]12CCC3C(CC=C4CC(O)CC[C@]34C)C1CCC2c1ccon1
: