Target
Steroid 17-alpha-hydroxylase/17,20 lyase
Ligand
BDBM50408265
Substrate
Meas. Tech.
ChEMBL_50387 (CHEMBL662843)
IC50
1500±n/a nM
Citation
 Ling, YZLi, JSLiu, YKato, KKlus, GTBrodie, A 17-Imidazolyl, pyrazolyl, and isoxazolyl androstene derivatives. Novel steroidal inhibitors of human cytochrome C17,20-lyase (P450(17 alpha). J Med Chem 40:3297-304 (1997)  
Target
Name:
Steroid 17-alpha-hydroxylase/17,20 lyase
Synonyms:
CP17A_RAT Cyp17a1 Cytochrome P450 17A1 Steroid 17-alpha-hydroxylase/17,20 lyase
Type:
Enzyme
Mol. Mass.:
57255.68
Organism:
Rattus norvegicus (Rat)
Description:
P11715
Residue:
507
  
Inhibitor
Name:
BDBM50408265
Synonyms:
CHEMBL2112534
Type:
Small organic molecule
Emp. Form.:
C24H32N2O2
Mol. Mass.:
380.5231
SMILES:
CC(=O)O[C@H]1CC[C@]2(C)[C@H]3CC[C@@]4(C)[C@@H](CC=C4c4cnc[nH]4)[C@@H]3CC=C2C1
: