Target
Adenosine receptor A2a
Ligand
BDBM50508690
Substrate
Meas. Tech.
ChEMBL_1833776 (CHEMBL4333784)
Ki
1.6±n/a nM
Citation
 Varano, FCatarzi, DFalsini, MDal Ben, DBuccioni, MMarucci, GVolpini, RColotta, V Novel human adenosine receptor antagonists based on the 7-amino-thiazolo[5,4-d]pyrimidine scaffold. Structural investigations at the 2-, 5- and 7-positions to enhance affinity and tune selectivity. Bioorg Med Chem Lett 29:563-569 (2019)  
Target
Name:
Adenosine receptor A2a
Synonyms:
A2A adenosine receptor (hA2A) ADENOSINE A2 ADORA2 Adenosine A2A receptor (A2AAR)
Type:
G Protein-Coupled Receptor (GPCR)
Mol. Mass.:
44716.46
Organism:
Homo sapiens (Human)
Description:
P29274
Residue:
412
  
Inhibitor
Name:
BDBM50508690
Synonyms:
CHEMBL4529321
Type:
Small organic molecule
Emp. Form.:
C15H10N4O2S
Mol. Mass.:
310.331
SMILES:
Nc1nc(nc2sc(nc12)-c1ccco1)-c1cccc(O)c1
: