Target
Cathepsin B
Ligand
BDBM50061512
Substrate
Meas. Tech.
ChEMBL_47404 (CHEMBL885063)
IC50
>300000±n/a nM
Citation
 Ogilvie, WBailey, MPoupart, MAAbraham, ABhavsar, ABonneau, PBordeleau, JBousquet, YChabot, CDuceppe, JSFazal, GGoulet, SGrand-Maître, CGuse, IHalmos, TLavallée, PLeach, MMalenfant, EO'Meara, JPlante, RPlouffe, CPoirier, MSoucy, FYoakim, CDéziel, R Peptidomimetic inhibitors of the human cytomegalovirus protease. J Med Chem 40:4113-35 (1998)  
Target
Name:
Cathepsin B
Synonyms:
APP secretase CATB_HUMAN CTSB Cathepsin B light chain | Cathepsin B1
Type:
Enzyme
Mol. Mass.:
37819.69
Organism:
Homo sapiens (Human)
Description:
gi_63102437
Residue:
339
  
Inhibitor
Name:
BDBM50061512
Synonyms:
(S)-N*1*-(2-Benzooxazol-2-yl-1-methyl-2-oxo-ethyl)-2-[(S)-2-(3,3-dimethyl-butyrylamino)-3,3-dimethyl-butyrylamino]-N*4*,N*4*-dimethyl-succinamide CHEMBL131909
Type:
Small organic molecule
Emp. Form.:
C28H41N5O6
Mol. Mass.:
543.655
SMILES:
CC(NC(=O)[C@H](CC(=O)N(C)C)NC(=O)[C@@H](NC(=O)CC(C)(C)C)C(C)(C)C)C(=O)c1nc2ccccc2o1
: