Target
Muscarinic acetylcholine receptor M3
Ligand
BDBM50061706
Substrate
Meas. Tech.
ChEMBL_138586 (CHEMBL746514)
IC50
300±n/a nM
Citation
 Bromidge, SMBrown, FCassidy, FClark, MSDabbs, SHadley, MSHawkins, JLoudon, JMNaylor, CBOrlek, BSRiley, GJ Design of [R-(Z)]-(+)-alpha-(methoxyimino)-1-azabicyclo[2.2.2]octane-3-acetonitri le (SB 202026), a functionally selective azabicyclic muscarinic M1 agonist incorporating the N-methoxy imidoyl nitrile group as a novel ester bioisostere. J Med Chem 40:4265-80 (1998)  
Target
Name:
Muscarinic acetylcholine receptor M3
Synonyms:
ACM3_HUMAN Cholinergic, muscarinic M3 Muscarinic receptor M3 | RecName: Full=Muscarinic acetylcholine receptor M3
Type:
Enzyme
Mol. Mass.:
66151.03
Organism:
Homo sapiens (Human)
Description:
P20309
Residue:
590
  
Inhibitor
Name:
BDBM50061706
Synonyms:
(1-Aza-bicyclo[2.2.1]hept-4-yl)-[(Z)-methoxyimino]-acetonitrile | CHEMBL344892
Type:
Small organic molecule
Emp. Form.:
C9H13N3O
Mol. Mass.:
179.219
SMILES:
CO\N=C(/C#N)C12CCN(CC1)C2
: