Target
Calcitonin gene-related peptide type 1 receptor
Ligand
BDBM50062176
Substrate
Meas. Tech.
ChEMBL_44489 (CHEMBL659129)
IC50
170±n/a nM
Citation
 Rist, BEntzeroth, MBeck-Sickinger, AG From micromolar to nanomolar affinity: a systematic approach to identify the binding site of CGRP at the human calcitonin gene-related peptide 1 receptor. J Med Chem 41:117-23 (1998)  
Target
Name:
Calcitonin gene-related peptide type 1 receptor
Synonyms:
Adrenomedullin receptor AM1; CALCRL/RAMP2 CALRL_HUMAN CGRP type 1 receptor mRNA Calcitonin gene-related peptide (CGRP) receptor Calcitonin receptor-like receptor Human CL receptor
Type:
Enzyme Catalytic Domain
Mol. Mass.:
52980.45
Organism:
Homo sapiens (Human)
Description:
Q16602
Residue:
461
  
Inhibitor
Name:
BDBM50062176
Synonyms:
CHEMBL411804 | FVPTDVG-Aib-FAF
Type:
Small organic molecule
Emp. Form.:
C59H81N11O15
Mol. Mass.:
1184.3391
SMILES:
CC(C)[C@H](NC(=O)[C@H](CC(O)=O)NC(=O)[C@@H](NC(=O)[C@@H]1CCCN1C(=O)[C@@H](NC(=O)[C@@H](N)Cc1ccccc1)C(C)C)[C@@H](C)O)C(=O)NCC(=O)NC(C)(C)C(=O)N[C@@H](Cc1ccccc1)C(=O)N[C@@H](C)C(=O)N[C@@H](Cc1ccccc1)C(O)=O
: