Target
5-hydroxytryptamine receptor 1A
Ligand
BDBM50062273
Substrate
Meas. Tech.
ChEMBL_1210 (CHEMBL615976)
Ki
0.34±n/a nM
Citation
 Zhuang, ZPKung, MPMu, MKung, HF Isoindol-1-one analogues of 4-(2'-methoxyphenyl)-1-[2'-[N-(2"-pyridyl)-p-iodobenzamido]ethyl]pipera zine (p-MPPI) as 5-HT1A receptor ligands. J Med Chem 41:157-66 (1998)  
Target
Name:
5-hydroxytryptamine receptor 1A
Synonyms:
5-HT-1A 5-HT1A 5-hydroxytryptamine receptor 1A (5HT1A) 5ht1a Htr1a Serotonin 1a (5-HT1a) receptor/Adrenergic receptor alpha-1 | Serotonin receptor 1A
Type:
G Protein-Coupled Receptor (GPCR)
Mol. Mass.:
46445.29
Organism:
Rattus norvegicus (rat)
Description:
Binding assays were performed using rat hippocampal membranes.
Residue:
422
  
Inhibitor
Name:
BDBM50062273
Synonyms:
3-Hydroxy-2-{2-[4-(2-methoxy-phenyl)-piperazin-1-yl]-ethyl}-6-nitro-3-phenyl-2,3-dihydro-isoindol-1-one | CHEMBL439740
Type:
Small organic molecule
Emp. Form.:
C27H28N4O5
Mol. Mass.:
488.535
SMILES:
COc1ccccc1N1CCN(CCN2C(=O)c3cc(ccc3C2(O)c2ccccc2)[N+]([O-])=O)CC1
: