Target
Progesterone receptor
Ligand
BDBM50062419
Substrate
Meas. Tech.
ChEMBL_159557 (CHEMBL765845)
Ki
0.69±n/a nM
Citation
 Zhi, LTegley, CMKallel, EAMarschke, KBMais, DEGottardis, MMJones, TK 5-Aryl-1,2-dihydrochromeno[3,4-f]quinolines: a novel class of nonsteroidal human progesterone receptor agonists. J Med Chem 41:291-302 (1998)  
Target
Name:
Progesterone receptor
Synonyms:
NR3C3 PGR PRGR_HUMAN | progesterone
Type:
Protein
Mol. Mass.:
98979.52
Organism:
Homo sapiens (Human)
Description:
P06401
Residue:
933
  
Inhibitor
Name:
BDBM50062419
Synonyms:
5-(3-Fluoro-phenyl)-2,2,4-trimethyl-2,5-dihydro-1H-6-oxa-1-aza-chrysene | CHEMBL103237
Type:
Small organic molecule
Emp. Form.:
C25H22FNO
Mol. Mass.:
371.4467
SMILES:
CC1=CC(C)(C)Nc2ccc3-c4ccccc4OC(c4cccc(F)c4)c3c12
: