Target
Neutrophil collagenase
Ligand
BDBM50062462
Substrate
Meas. Tech.
ChEMBL_105076 (CHEMBL711321)
Ki
189000±n/a nM
Citation
 Graf von Roedern, EGrams, FBrandstetter, HMoroder, L Design and synthesis of malonic acid-based inhibitors of human neutrophil collagenase (MMP8). J Med Chem 41:339-45 (1998)  
Target
Name:
Neutrophil collagenase
Synonyms:
CLG1 MMP8 Matrix metalloproteinase-8 PMNL collagenase | PMNL-CL
Type:
Enzyme
Mol. Mass.:
53413.48
Organism:
Homo sapiens (Human)
Description:
P22894
Residue:
467
  
Inhibitor
Name:
BDBM50062462
Synonyms:
2-Hydroxycarbamoyl-4-phenyl-butyric acid ethyl ester ethyl 2-(hydroxycarbamoyl)-4-phenylbutanoate
Type:
Small organic molecule
Emp. Form.:
C13H17NO4
Mol. Mass.:
251.2784
SMILES:
CCOC(=O)C(CCc1ccccc1)C(=O)NO
: