Target
Nuclear factor NF-kappa-B p105 subunit
Ligand
BDBM50062659
Substrate
Meas. Tech.
ChEMBL_143916 (CHEMBL752719)
IC50
4000±n/a nM
Citation
 Sullivan, RWBigam, CGErdman, PEPalanki, MSAnderson, DWGoldman, MERansone, LJSuto, MJ 2-Chloro-4-(trifluoromethyl)pyrimidine-5-N-(3',5'- bis(trifluoromethyl)phenyl)-carboxamide: a potent inhibitor of NF-kappa B- and AP-1-mediated gene expression identified using solution-phase combinatorial chemistry. J Med Chem 41:413-9 (1998)  
Target
Name:
Nuclear factor NF-kappa-B p105 subunit
Synonyms:
NFKB1 Nuclear factor NF-kappa-B (NF-kB) Nuclear factor NF-kappa-B p105 subunit
Type:
Protein
Mol. Mass.:
105329.57
Organism:
Homo sapiens (Human)
Description:
P19838
Residue:
968
  
Inhibitor
Name:
BDBM50062659
Synonyms:
2-Chloro-4-trifluoromethyl-pyrimidine-5-carboxylic acid (3-methyl-isoxazol-5-yl)-amide | CHEMBL335697
Type:
Small organic molecule
Emp. Form.:
C10H6ClF3N4O2
Mol. Mass.:
306.628
SMILES:
Cc1cc(NC(=O)c2cnc(Cl)nc2C(F)(F)F)on1
: