Target
Liver carboxylesterase 1
Ligand
BDBM50063239
Substrate
Meas. Tech.
ChEMBL_28653 (CHEMBL643832)
IC50
10±n/a nM
Citation
 Sliskovic, DRPicard, JAO'Brien, PMLiao, PRoark, WHRoth, BDAnderson, MAMueller, SBBocan, TMBousley, RFHamelehle, KLHoman, RReindel, JFStanfield, RLTurluck, DKrause, BR alpha-Substituted malonester amides: tools to define the relationship between ACAT inhibition and adrenal toxicity. J Med Chem 41:682-90 (1998)  
Target
Name:
Liver carboxylesterase 1
Synonyms:
Carboxylesterase 1 liver carboxylesterase 1 | rCE
Type:
Enzyme
Mol. Mass.:
62292
Organism:
Oryctolagus cuniculus (rabbit)
Description:
Residue:
565
  
Inhibitor
Name:
BDBM50063239
Synonyms:
CHEMBL161638 | N-(2,6-Diisopropyl-phenyl)-2-phenyl-malonamic acid dodecyl ester
Type:
Small organic molecule
Emp. Form.:
C33H49NO3
Mol. Mass.:
507.7471
SMILES:
CCCCCCCCCCCCOC(=O)C(C(=O)Nc1c(cccc1C(C)C)C(C)C)c1ccccc1
: