Target
D(2) dopamine receptor
Ligand
BDBM50063277
Substrate
Meas. Tech.
ChEMBL_60370 (CHEMBL672206)
Ki
8.5±n/a nM
Citation
 Wustrow, DBelliotti, TGlase, SKesten, SRJohnson, DColbry, NRubin, RBlackburn, AAkunne, HCorbin, ADavis, MDGeorgic, LWhetzel, SZoski, KHeffner, TPugsley, TWise, L Aminopyrimidines with high affinity for both serotonin and dopamine receptors. J Med Chem 41:760-71 (1998)  
Target
Name:
D(2) dopamine receptor
Synonyms:
D(2) dopamine receptor DOPAMINE D2 Long DRD2 Dopamine D2 receptor Dopamine D2 receptor (D2R) Dopamine2-like | d2
Type:
Cell-surface receptors
Mol. Mass.:
50647.10
Organism:
Homo sapiens (Human)
Description:
P14416
Residue:
443
  
Inhibitor
Name:
BDBM50063277
Synonyms:
(4-{2-[4-(4-Fluoro-phenyl)-piperazin-1-yl]-ethyl}-cyclohexyl)-pyrimidin-2-yl-amine | CHEMBL349034
Type:
Small organic molecule
Emp. Form.:
C22H30FN5
Mol. Mass.:
383.5055
SMILES:
Fc1ccc(cc1)N1CCN(CC[C@H]2CC[C@@H](CC2)Nc2ncccn2)CC1
: