Target
5-hydroxytryptamine receptor 1A
Ligand
BDBM50063277
Substrate
Meas. Tech.
ChEMBL_1451 (CHEMBL616575)
Ki
4.5±n/a nM
Citation
 Wustrow, DBelliotti, TGlase, SKesten, SRJohnson, DColbry, NRubin, RBlackburn, AAkunne, HCorbin, ADavis, MDGeorgic, LWhetzel, SZoski, KHeffner, TPugsley, TWise, L Aminopyrimidines with high affinity for both serotonin and dopamine receptors. J Med Chem 41:760-71 (1998)  
Target
Name:
5-hydroxytryptamine receptor 1A
Synonyms:
5-HT-1A 5-HT1A 5-hydroxytryptamine receptor 1A (5HT1A) 5ht1a Htr1a Serotonin 1a (5-HT1a) receptor/Adrenergic receptor alpha-1 | Serotonin receptor 1A
Type:
G Protein-Coupled Receptor (GPCR)
Mol. Mass.:
46445.29
Organism:
Rattus norvegicus (rat)
Description:
Binding assays were performed using rat hippocampal membranes.
Residue:
422
  
Inhibitor
Name:
BDBM50063277
Synonyms:
(4-{2-[4-(4-Fluoro-phenyl)-piperazin-1-yl]-ethyl}-cyclohexyl)-pyrimidin-2-yl-amine | CHEMBL349034
Type:
Small organic molecule
Emp. Form.:
C22H30FN5
Mol. Mass.:
383.5055
SMILES:
Fc1ccc(cc1)N1CCN(CC[C@H]2CC[C@@H](CC2)Nc2ncccn2)CC1
: