Target
5-hydroxytryptamine receptor 1A
Ligand
BDBM50063286
Substrate
Meas. Tech.
ChEMBL_1451 (CHEMBL616575)
Ki
9.5±n/a nM
Citation
 Wustrow, DBelliotti, TGlase, SKesten, SRJohnson, DColbry, NRubin, RBlackburn, AAkunne, HCorbin, ADavis, MDGeorgic, LWhetzel, SZoski, KHeffner, TPugsley, TWise, L Aminopyrimidines with high affinity for both serotonin and dopamine receptors. J Med Chem 41:760-71 (1998)  
Target
Name:
5-hydroxytryptamine receptor 1A
Synonyms:
5-HT-1A 5-HT1A 5-hydroxytryptamine receptor 1A (5HT1A) 5ht1a Htr1a Serotonin 1a (5-HT1a) receptor/Adrenergic receptor alpha-1 | Serotonin receptor 1A
Type:
G Protein-Coupled Receptor (GPCR)
Mol. Mass.:
46445.29
Organism:
Rattus norvegicus (rat)
Description:
Binding assays were performed using rat hippocampal membranes.
Residue:
422
  
Inhibitor
Name:
BDBM50063286
Synonyms:
CHEMBL164723 | {4-[2-(4-Pyridin-3-yl-piperazin-1-yl)-ethyl]-cyclohexyl}-pyrimidin-2-yl-amine
Type:
Small organic molecule
Emp. Form.:
C21H30N6
Mol. Mass.:
366.5031
SMILES:
C(CN1CCN(CC1)c1cccnc1)[C@H]1CC[C@@H](CC1)Nc1ncccn1
: