Target
Steroid 17-alpha-hydroxylase/17,20 lyase
Ligand
BDBM50063477
Substrate
Meas. Tech.
ChEMBL_50385 (CHEMBL662841)
Ki
1.2±n/a nM
Citation
 Njar, VCKato, KNnane, IPGrigoryev, DNLong, BJBrodie, AM Novel 17-azolyl steroids, potent inhibitors of human cytochrome 17 alpha-hydroxylase-C17,20-lyase (P450(17) alpha): potential agents for the treatment of prostate cancer. J Med Chem 41:902-12 (1998)  
Target
Name:
Steroid 17-alpha-hydroxylase/17,20 lyase
Synonyms:
CP17A_HUMAN CYP17A1 Cytochrome P450 17A1 Cytochrome P450 C17 (CYP17) Cytochrome P450-C17 P450-C17 Steroid 17-alpha-Monooxygenase (CYP17) Steroid 17-alpha-monooxygenase | cytochrome P450 monooxygenase 17 alpha hydroxylase/17,20-lyase (CYP17)
Type:
Enzyme
Mol. Mass.:
57382.42
Organism:
Homo sapiens (Human)
Description:
E.coli expressing human CYP17
Residue:
508
  
Inhibitor
Name:
BDBM50063477
Synonyms:
(3S,10R,13S)-17-Imidazol-1-yl-10,13-dimethyl-2,3,4,7,8,9,10,11,12,13,14,15-dodecahydro-1H-cyclopenta[a]phenanthren-3-ol | CHEMBL74661
Type:
Small organic molecule
Emp. Form.:
C22H30N2O
Mol. Mass.:
338.4864
SMILES:
C[C@]12CCC3C(CC=C4C[C@@H](O)CC[C@]34C)C1CC=C2n1ccnc1
: