Target
Steroid 17-alpha-hydroxylase/17,20 lyase
Ligand
BDBM50063475
Substrate
Meas. Tech.
ChEMBL_50386 (CHEMBL662842)
IC50
8±n/a nM
Citation
 Njar, VCKato, KNnane, IPGrigoryev, DNLong, BJBrodie, AM Novel 17-azolyl steroids, potent inhibitors of human cytochrome 17 alpha-hydroxylase-C17,20-lyase (P450(17) alpha): potential agents for the treatment of prostate cancer. J Med Chem 41:902-12 (1998)  
Target
Name:
Steroid 17-alpha-hydroxylase/17,20 lyase
Synonyms:
CP17A_RAT Cyp17a1 Cytochrome P450 17A1 Steroid 17-alpha-hydroxylase/17,20 lyase
Type:
Enzyme
Mol. Mass.:
57255.68
Organism:
Rattus norvegicus (Rat)
Description:
P11715
Residue:
507
  
Inhibitor
Name:
BDBM50063475
Synonyms:
(10R,13S)-17-Imidazol-1-yl-10,13-dimethyl-1,2,6,7,8,9,10,11,12,13,14,15-dodecahydro-cyclopenta[a]phenanthren-3-one | CHEMBL310336
Type:
Small organic molecule
Emp. Form.:
C22H28N2O
Mol. Mass.:
336.4705
SMILES:
C[C@]12CCC3C(CCC4=CC(=O)CC[C@]34C)C1CC=C2n1ccnc1
: