Target
Prothrombin
Ligand
BDBM50063558
Substrate
Meas. Tech.
ChEMBL_208896 (CHEMBL814953)
Ki
70±n/a nM
Citation
 Lumma, WCWitherup, KMTucker, TJBrady, SFSisko, JTNaylor-Olsen, AMLewis, SDLucas, BJVacca, JP Design of novel, potent, noncovalent inhibitors of thrombin with nonbasic P-1 substructures: rapid structure-activity studies by solid-phase synthesis. J Med Chem 41:1011-3 (1998)  
Target
Name:
Prothrombin
Synonyms:
Activation peptide fragment 1 Coagulation factor II Prothrombin precursor Thrombin heavy chain | Thrombin light chain
Type:
Protein
Mol. Mass.:
70029.57
Organism:
Homo sapiens (Human)
Description:
P00734
Residue:
622
  
Inhibitor
Name:
BDBM50063558
Synonyms:
1-(2-Amino-3,3-diphenyl-propionyl)-pyrrolidine-2-carboxylic acid cyclohexylmethyl-amide | CHEMBL269332
Type:
Small organic molecule
Emp. Form.:
C27H35N3O2
Mol. Mass.:
433.5857
SMILES:
NC(C(c1ccccc1)c1ccccc1)C(=O)N1CCCC1C(=O)NCC1CCCCC1
: