Target
TGF-beta receptor type-1
Ligand
BDBM282825
Substrate
Meas. Tech.
ChEMBL_1838955 (CHEMBL4339088)
Ki
0.800000±n/a nM
Citation
 Velaparthi, UDarne, CPWarrier, JLiu, PRahaman, HAugustine-Rauch, KParrish, KYang, ZSwanson, JBrown, JDhar, GAnandam, AHolenarsipur, VKPalanisamy, KWautlet, BSFereshteh, MPLippy, JTebben, AJSheriff, SRuzanov, MYan, CGupta, AGupta, AKVetrichelvan, MMathur, AGelman, MSingh, RKinsella, TMurtaza, AFargnoli, JVite, GBorzilleri, RM Discovery of BMS-986260, a Potent, Selective, and Orally Bioavailable TGF?R1 Inhibitor as an Immuno-oncology Agent. ACS Med Chem Lett 11:172-178 (2020)  
Target
Name:
TGF-beta receptor type-1
Synonyms:
ALK-5 Activin A receptor type II-like protein kinase of 53kD SKR4 TGF-beta receptor type I TGFBR1 TGFR1_HUMAN Transforming growth factor-beta receptor type I
Type:
enzyme
Mol. Mass.:
55968.24
Organism:
Homo sapiens (Human)
Description:
P36897
Residue:
503
  
Inhibitor
Name:
BDBM282825
Synonyms:
6-(4-(3-chloro-4-fluorophenyl)-1-(2-hydroxyethyl)-1H- imidazol-5-yl)imidazo[1,2-b]pyridazine-3-carbonitrile US11352360, Example 32' | US9884868, Example 32'
Type:
Small organic molecule
Emp. Form.:
C18H12ClFN6O
Mol. Mass.:
382.779
SMILES:
OCCn1cnc(c1-c1ccc2ncc(C#N)n2n1)-c1ccc(F)c(Cl)c1
: