Target
Aldo-keto reductase family 1 member C4
Ligand
BDBM50384946
Substrate
Meas. Tech.
ChEMBL_1839209 (CHEMBL4339424)
IC50
21000±n/a nM
Citation
 Verma, KZang, TPenning, TMTrippier, PC Potent and Highly Selective Aldo-Keto Reductase 1C3 (AKR1C3) Inhibitors Act as Chemotherapeutic Potentiators in Acute Myeloid Leukemia and T-Cell Acute Lymphoblastic Leukemia. J Med Chem 62:3590-3616 (2019)  
Target
Name:
Aldo-keto reductase family 1 member C4
Synonyms:
3-alpha-HSD1 3-alpha-hydroxysteroid dehydrogenase type I AKR1C4 Aldo-keto reductase family 1 member C4 (AK1C4) CHDR DD-4 Dihydrodiol dehydrogenase 4 | HAKRA
Type:
Enzyme
Mol. Mass.:
37068.40
Organism:
Homo sapiens (Human)
Description:
P17516
Residue:
323
  
Inhibitor
Name:
BDBM50384946
Synonyms:
CHEMBL511708
Type:
Small organic molecule
Emp. Form.:
C23H24O4
Mol. Mass.:
364.4343
SMILES:
[#6]\[#6](-[#6])=[#6]/[#6]-c1cc(\[#6]=[#6]\[#6](-[#8])=O)ccc1-[#8]-[#6](=O)-[#6]-[#6]-c1ccccc1
: